{"text_format":"1","workbook":"xlsx","n_sheets":5,"sheets":["FORMULARIO","RUC","Tutor","Convenios","VAL"],"not_rendered":{"charts":0,"images":2,"macros":1,"external_links":2,"defined_names":53,"comments":0,"pivot_tables":0},"unopened":[],"bounds":{"document_bytes":16777216,"sheet_cells":100000,"rows_first":2000,"rows_last":500,"rows_between":2000,"halvings":0,"cell_chars":16384,"cell_head_chars":4096},"cells_cut":0,"cells_raw":0,"read":"whole","date_system":"1900"}

{"sheet":"FORMULARIO","index":0,"n_rows":93,"n_cols":10,"rows_kept":93,"cut":false,"hidden":false,"merged":[[88,0,88,4],[90,0,90,4],[87,5,87,9],[88,5,88,9],[90,5,90,9],[86,7,86,9],[13,3,13,9],[13,0,13,2],[32,5,32,9],[33,5,33,9],[69,5,69,9],[19,3,19,9],[23,3,23,9],[24,3,24,9],[25,3,25,9],[22,3,22,9],[23,0,23,2],[24,0,24,2],[21,0,21,9],[22,0,22,2],[25,0,25,2],[86,5,86,6],[47,0,47,6],[66,2,66,4],[1,0,1,9],[2,0,2,9],[3,0,3,1],[3,2,3,9],[27,4,27,9],[28,5,28,9],[29,5,29,9],[30,5,30,9],[31,5,31,9],[11,1,11,4],[11,8,11,9],[7,0,7,9],[8,0,8,1],[8,2,8,9],[9,0,9,1],[9,2,9,9],[10,0,10,1],[10,2,10,9],[12,0,12,2],[4,0,4,1],[4,3,4,9],[5,0,5,9],[15,0,15,2],[12,3,12,9],[67,0,67,4],[68,0,68,4],[69,0,69,4],[62,0,62,5],[84,7,84,9],[78,0,78,9],[79,4,79,7],[80,4,80,7],[81,4,81,7],[65,5,65,9],[66,5,66,6],[67,5,67,9],[68,5,68,9],[38,0,38,9],[54,0,54,9],[55,0,55,9],[56,0,56,9],[40,0,40,1],[47,7,47,9],[91,1,91,4],[92,1,92,4],[66,0,66,1],[84,0,84,1],[65,0,65,4],[74,3,74,4],[74,5,74,7],[91,6,91,9],[70,1,70,4],[71,1,71,4],[72,1,72,4],[70,6,70,9],[71,6,71,9],[72,6,72,9],[83,5,83,9],[83,0,83,4],[84,2,84,4],[84,5,84,6],[85,5,85,6],[82,0,82,9],[75,0,75,9],[66,7,66,9],[76,0,76,9],[73,0,73,9],[14,3,14,9],[15,3,15,9],[18,3,18,9],[46,1,46,9],[17,0,17,9],[18,0,18,2],[19,0,19,2],[27,0,27,1],[28,0,29,1],[30,0,31,1],[28,2,29,2],[30,2,31,2],[32,0,33,1],[32,2,33,2],[28,3,29,3],[30,3,31,3],[32,3,33,3],[14,0,14,2],[60,0,60,5],[61,0,61,5],[50,0,50,9],[35,0,35,9],[36,0,36,9],[41,0,41,9],[58,0,58,5],[77,0,77,9],[89,0,89,4],[89,5,89,9],[42,6,42,7],[42,3,42,4],[42,0,42,1],[42,8,44,9],[45,8,45,9],[40,2,40,9],[48,0,48,9],[49,0,49,9],[51,0,51,9],[52,0,53,7],[57,0,57,9],[59,0,59,5],[85,7,85,9],[87,0,87,4]]}
[null,null,null,null,null,null,null,null,"FORMULARIO","F_AA_119"]
["ESCUELA POLITÉCNICA NACIONAL"]
[{"$f":"VLOOKUP(C4,VAL!A42:B85,2,FALSE)","v":"FACULTAD DE CIENCIAS"}]
["CARRERA:",null,"Ingeniería en Ciencias Económicas y Financieras"]
["MODALIDAD",null,"PRESENCIAL"]
["INFORME DE PRÁCTICAS PREPROFESIONALES \n(PRÁCTICAS LABORALES O SERVICIO A LA COMUNIDAD)"]
[]
["1. DATOS DE LA EMPRESA O INSTITUCIÓN"]
["Razón Social:"]
["Dirección:",null,{"$f":"LOOKUP($C$9,RUC!$A$1:$J$109,RUC!$B$1:$B$109)","v":{"$error":"#N/A"}}]
["Correo Electrónico:",null,{"$f":"LOOKUP($C$9,RUC!$A$1:$J$109,RUC!$C$1:$C$109)","v":{"$error":"#N/A"}}]
["Ciudad:",null,null,null,null,"Teléfono:",{"$f":"LOOKUP($C$9,RUC!$A$1:$J$109,RUC!$D$1:$D$109)","v":{"$error":"#N/A"}},"Celular:"]
["Tipo de Empresa o Institución:",null,null,"PRIVADA"]
["Tutor de la Empresa o Institución *:"]
["Tutor General de la Entidad Formadora:"]
["Tutor Específico de la Entidad Formadora:"]
[]
["2. DATOS DEL PRACTICANTE"]
["Nombres y Apellidos:"]
["Cédula de Identidad:"]
[]
["3. INFORMACIÓN SOBRE LAS PRÁCTICAS LABORALES O SERVICIO A LA COMUNIDAD"]
["Tipo de Práctica",null,null,"LABORAL"]
["Campo Amplio:",null,null,"ADMINISTRACION"]
["Campo Específico:",null,null,"Educación comercial y administración"]
["Tutor de la Práctica (EPN):"]
[]
["RELACIÓN CON",null,"SI","NO","DETALLE"]
["Convenio",null,null,null,"Código"]
[null,null,null,null,"Título"]
{"$rows_left_out":64}
{"sheet":"RUC","index":1,"n_rows":106,"n_cols":10,"rows_kept":106,"cut":false,"hidden":false,"merged":[]}
["Razón Social","Dirección","Correo","Teléfono","Celular","Nombre Comercial","RUC","Actividad","Tipo de Contribuyente","Subtipo de Contribuyente"]
["AGROEXPORTADORA E IMPORTADORA CHOCOSPICES CIA. LTDA.","Calle Loja #1012 entre Av. Quito y Av. Galápagos","secretaria@comexgar.com\ncontabilidad@comexgar.com","275 4158\n276 0848","099 423 7436\n0990777 8230","CHOCOSPICES CIA. LTDA.","2390007062001","ELABORACION DE OTROS ALIMENTOS","SOCIEDAD","BAJO CONTROL DE LA SUPERINTENDENCIA DE COMPAÑIAS"]
["ASESORIA TRIBUTARIA LEGAL Y CONTABLE ATLYCONT CIA. LTDA.","Andres Paredes N3-135 Pasaje Dos",null,null,null,"ATLYCONT","1792161452001","ASESORAMIENTO LEGAL Y CONTABLE EN MATERIA TRIBUTARIA A PERSONAS NATURALES Y JURIDICAS Y SERVICIOS DE OUTSOURCING EN LA MISMA MATERIA","SOCIEDAD","BAJO CONTROL DE LA SUPERINTENDENCIA DE COMPAÑIAS"]
["ASOCIACION ECUATORIANA PARA NIÑOS CON CANCER ASONIC","Luis Cordero E8-51 Jose Urbina",null,"098 465 3014","098 465 3014","ASONIC","1791881605001","ACTIVIDADES DE AYUDA SOCIAL","SOCIEDAD","SOCIEDADES Y ORGANIZACIONES NO GUBERNAMENTALES SIN FINES DE LUCRO"]
["ASOCIACION INTERNACIONAL DE ESTUDIANTES DE CIENCIAS ECONOMICAS Y COMERCIALES AIESEC","Juaquin Pinto E4-286 Amazonas",null,null,null,"AIESEC","0991340122001","ACTIVIDADES REALIZADAS POR ASOCIACIONES DE ESTUDIANTES","SOCIEDAD","SOCIEDADES Y ORGANIZACIONES NO GUBERNAMENTALES SIN FINES DE LUCRO"]
["BANCO CENTRAL DEL ECUADOR","Av. 10 de Agosto N11-409 y Briceño",null,"393 8600 Ext. 2656",null,"BCE","1760002600001","ACTIVIDADES RELACIONADAS CON LA BANCA CENTRAL","SOCIEDAD","ORGANISMOS Y ENTIDADES PUBLICAS CREADAS POR LA CONSTITUCION O LA LEY"]
["BANCO DE DESARROLLO DEL ECUADOR B.P.","Av. Rio Amazonas s/n Union Nacional de Periodistas","info@bde.fin.ec","299 9600",null,"BDE","1760002950001","ORGANISMOS DE ADMINISTRACION CENTRAL, REGIONAL Y LOCAL.","SOCIEDAD","ORGANISMOS Y ENTIDADES PUBLICAS CREADAS POR LA CONSTITUCION O LA LEY"]
["BANCO DE LA PRODUCCION S.A. PRODUBANCO","EKOPARK, Simón Bolívar y Nayón",null,"2999 0000",null,"PRODUBANCO","1790368718001","ACTIVIDADES DE INTERMEDIACION MONETARIA REALIZADA POR LA BANCA COMERCIAL","SOCIEDAD","BAJO CONTROL DE LA SUPERINTENDENCIA DE BANCOS"]
["BANCO DEL INSTITUTO ECUATORIANO DE SEGURIDAD SOCIAL","Av. Rio Amazonas s/n Union Nacional de Periodistas","ayudaprestamos@biess.fin.ec","1800-243 777",null,"BIESS","1768156470001","PRESTACION DE SERVICIOS FINANCIEROS","SOCIEDAD","ORGANISMOS Y ENTIDADES PUBLICAS CREADAS POR LA CONSTITUCION O LA LEY"]
["BANCO GENERAL RUMIÑAHUI S. A.",null,null,null,null,"BGR","1790864316001","BANCA COMERCIAL","SOCIEDAD","BAJO CONTROL DE LA SUPERINTENDENCIA DE BANCOS"]
["BANCO SOLIDARIO S.A.",null,null,null,null,"BANCO SOLIDARIO S.A.","1791109384001","ACTIVIDADES DE INTERMEDIACION MONETARIA REALIZADA POR LA BANCA COMERCIAL","SOCIEDAD","BAJO CONTROL DE LA SUPERINTENDENCIA DE BANCOS"]
["BOLSA DE VALORES DE QUITO BVQ SOCIEDAD ANONIMA",null,"sandracevallos@bolsadequito.com",null,"09 956 04388","BOLSA DE VALORES DE QUITO BVQ SOCIEDAD ANONIMA","1790008967001","SERVICIOS Y MECANISMOS PARA LA NEGOCIACION DE VALORES","SOCIEDAD","BAJO CONTROL DE LA SUPERINTENDENCIA DE COMPAÑIAS"]
["BSOFT DEVELOPERS S.A.",null,null,null,null,"BSOFT SOLUTION","1792093694001","PRESTACION DE SERVICIOS INFORMATICOS QUE SE DERRIVAN DEL MUNDO COMPUTARIZADO Y TECNOLOGICO","SOCIEDAD","BAJO CONTROL DE LA SUPERINTENDENCIA DE COMPAÑIAS"]
["CAMARA DE COMERCIO DE QUITO",null,null,null,null,"CAMARA DE COMERCIO DE QUITO","1790899780001","ACTIVIDADES DE CAMARAS DE COMERCIO, GREMIOS Y ORGANIZACIONES SIMILARES","SOCIEDAD"," SOCIEDADES Y ORGANIZACIONES NO GUBERNAMENTALES SIN FINES DE LUCRO"]
["CAMARA DE TRANSPORTE PESADO DE PICHINCHA",null,null,null,null,"C.T.P.P","1791372077001","ORGANIZACION GREMIAL","SOCIEDAD","SOCIEDADES Y ORGANIZACIONES NO GUBERNAMENTALES SIN FINES DE LUCRO"]
["CAMARA OFICIAL ESPANOLA DE COMERCIO E INDUSTRIA DE QUITO","Av. Amazonas 3123 y Azuay, Edificio Copladi, piso 2. Iñaquito","rafaelroldan@camespa.net","244 6984","099 972 2341","CAMESPA","1790897141001","ACTIVIDADES DE ASESORIA COMERCIAL","SOCIEDAD","SOCIEDADES Y ORGANIZACIONES NO GUBERNAMENTALES SIN FINES DE LUCRO"]
["CAMARA OFICIAL ESPANOLA DE COMERCIO E INDUSTRIA DE QUITO","Av. Amazonas 3123 y Azuay, Edificio Copladi, piso 2. Iñaquito","marciapesantez@camespa.net","(593.2) 2446984","099 971 3884","CAMESPA","1790897141001","ACTIVIDADES DE ASESORIA COMERCIAL","SOCIEDAD","SOCIEDADES Y ORGANIZACIONES NO GUBERNAMENTALES SIN FINES DE LUCRO"]
["CENTRO DE CAPACITACION PARA LA MUJER MARIA DROSTE"]
["CENTRO DE ESTUDIOS ESTADISTICOS DSANALYTICS CIA.LTDA. EN LIQUIDACION","Av Rio Amazonas N35-55 Juan Pablo Sanz","andres.pena.montalvo@gmail.com","601 4235\n601 4236","098 779 1217","DS ANALYTICS","1792782481001","ESTUDIOS SOBRE LAS POSIBILIDADES DE COMERCIALIZACIÓN (MERCADOS POTENCIALES), LA ACEPTACIÓN Y EL GRADO DE CONOCIMIENTO DE LOS PRODUCTOS Y LOS HÁBITOS DE COMPRA DE LOS CONSUMIDORES CON EL OBJETO DE PROMOVER LAS VENTAS Y DESARROLLAR NUEVOS PRODUCTOS, INCLUIDOS ANÁLISIS ESTADÍSTICOS DE LOS RESULTADOS","SOCIEDAD","BAJO CONTROL DE LA SUPERINTENDENCIA DE COMPAÑIAS"]
["CINEMATECA DE LA CASA DE LA CULTURA NACIONAL"]
["CLINICA DEL APRENDIZAJE"]
["COBISCORP ECUADOR S.A","Cumbayá del Establo 50 y del Charro",null,"380 2920",null,"COBISCORP","1790659720001","VENTA AL POR MAYOR Y MENOR DE EQUIPOS Y SISTEMAS DE SOFTWARE","SOCIEDAD","BAJO CONTROL DE LA SUPERINTENDENCIA DE COMPAÑIAS"]
["COMPAÑIA DE SERVICIOS AUXILIARES DE GESTION DE COBRANZA RECYCOB S.A.","Av. Amazonas y Patria, Esq. Edificio COFIEC Piso No. 12","gabriela.quinchiguango@recycob.fin.ec","(593 2) 2560 939 / 2521 639 Ext 125",null,"RECYCOB S.A.","1790021831001","ACTIVIDADES DE COBRANZAS","SOCIEDAD","BAJO CONTROL DE LA SUPERINTENDENCIA DE BANCOS"]
["COMPAÑIA DE TRANSPORTE PESADO Y DE CARGA MAYDELEFIC S.A.",null,null,null,null,"MAYDELEFIC S.A.","0591729314001","SERVICIO DE TRANSPORTE DE CARGA PESADA","SOCIEDAD","BAJO CONTROL DE LA SUPERINTENDENCIA DE COMPAÑIAS"]
["COMUNIDAD DE RELIGIOSAS ADORATRICES, ESCLAVAS DEL SANTISIMO SACRAMENTO Y DE LA CARIDAD",null,null,null,null,"RELIGIOSAS ADORATRICES QUITO","1791932803001","ACTIVIDADES DE AYUDA SOCIAL A LA MUJER","SOCIEDAD","SOCIEDADES Y ORGANIZACIONES NO GUBERNAMENTALES SIN FINES DE LUCRO"]
["CONESTACOMU COMUNICACIONES S.A.",null,null,null,null,"NUMMA","1792466172001","ENCUESTAS DE OPINION PUBLICA SOBRE CUESTIONES POLITICAS, ECONOMICAS Y SOCIALES","SOCIEDAD","BAJO CONTROL DE LA SUPERINTENDENCIA DE COMPAÑIAS"]
["CONFITECA C.A.",null,null,null,null,"CONFITECA","1790084604001","ACTIVIDADES DE FABRICACION DE PRODUCTOS DE CONFITERIA","SOCIEDAD","BAJO CONTROL DE LA SUPERINTENDENCIA DE COMPAÑIAS"]
["CONSORCIO DE MUNICIPIOS AMAZONICOS Y GALAPAGOS",null,null,null,null,"COMAGA","1768160230001","ACTIVIDADES DE COORDINACION DE ORGANISMOS DE ADMINISTRACION SECCIONAL Y DE REGULACION","SOCIEDAD","ORGANISMOS Y ENTIDADES PUBLICAS CREADAS POR LA CONSTITUCION O LA LEY"]
["COOPERATIVA DE AHORRO Y CREDITO 15 DE ABRIL LTDA.",null,null,null,null,null,"1390013678001","ACTIVIDADES DE INTERMEDIACION MONETARIA REALIZADA POR COOPERATIVAS","SOCIEDAD","SISTEMA FINANCIERO POPULAR Y SOLIDARIO"]
["COOPERATIVA DE AHORRO Y CREDITO GUARANDA LTDA.",null,null,null,null,"COOPERATIVA DE AHORRO Y CREDITO GUARANDA LTDA.","0290001269001","ACTIVIDADES DE INTERMEDIACION MONETARIA REALIZADA POR COOPERATIVAS","SOCIEDAD","SISTEMA FINANCIERO POPULAR Y SOLIDARIO"]
{"$rows_left_out":77}
{"sheet":"Tutor","index":2,"n_rows":96,"n_cols":7,"rows_kept":96,"cut":false,"hidden":false,"merged":[[0,0,0,6],[4,0,4,6],[5,0,5,6]]}
["ESCUELA POLITÉCNICA NACIONAL"]
[]
[]
[]
["Lista Tutores Estudiantes Período:2020-A Facultad: CIENCIAS "]
["Fuente: SAEw - 05/06/2020 11:00:04"]
["Profesor","CódigoProf2","Departamento","EmailEPN","Extensión","Celular","Observaciones"]
["ACEVEDO TAPIA PAUL ANDRES","1712622164","MATEMATICA","paul.acevedo@epn.edu.ec",1569,"098 315 1293"]
["ACURIO MENDEZ ELIANA MARIBEL","1717677007","FISICA","eliana.acurio@epn.edu.ec",1527,"0998051595"]
["AGUILAR ENRIQUEZ MIGUEL ALEJANDRO","1721884391","MATEMATICA","miguel.aguilar@epn.edu.ec",1558,"098 409 6792","TECNICO DOCENTE"]
["ALMEIDA RODRIGUEZ CARLOS ALBERTO","1711994689","MATEMATICA","carlos.almeidar@epn.edu.ec",1561,"09 99708241"]
["ARAUJO GRIJALVA NELSON ALEJANDRO","1705133716","MATEMATICA","alejandro.araujo@epn.edu.ec",1564,"09 98071573"]
["ARIAS NAVARRETE RUBI YOHANDRA","1720305331","MATEMATICA","rubi.arias@epn.edu.ec",1555,"097 909 4279","TECNICO DOCENTE"]
["AVALOS CASCANTE FAUSTO EDUARDO","0601102544"]
["AYALA AMAYA EDY RODRIGO","1706562079","FISICA","edy.ayala@epn.edu.ec",1709,"0992668614"]
["BAEZ JACOME VERA SELENE","1712171865","BIOLOGIA","selene.baez@epn.edu.ec",null,"099 537 1193"]
["BARBIER HUGO JEAN MARC PAUL","1753377447","FISICA","hugo.barbier@epn.edu.ec",1704,"0989461729"]
["BASILE CARRASCO LEONARDO ALBERTO","1708794332","FISICA","leonardo.basile@epn.edu.ec",1705,"0987000685"]
["BAYAS REA MARCO VINICIO","0201036662","FISICA","marco.bayas@epn.edu.ec",1702,"0992640826"]
["BENALCAZAR PALADINES HOLGER EFRAIN","1707135420","MATEMATICA","holger.benalcazar@epn.edu.ec",1552,"09 87689244"]
["BENITEZ ROMERO MARIA JOSE","1713146353","FISICA","maria.benitezr@epn.edu.ec",1714,"0989168576"]
["BONILLA BOLAÑOS ANDREA GABRIELA","1714774096","ECONOMIA CUANTITATIVA","andrea.bonilla@epn.edu.ec  andybonillab@gmail.con",1580,"0996430032"]
["BORGES VILORIA NERIO ALBERTO","1758819120","MATEMATICA","nerio.borges@epn.edu.ec",null,"098 043 8109","PROFESOR OCASIONAL"]
["BURBANO RODRIGUEZ RAFAEL TIBERIO","1801506286","ECONOMIA CUANTITATIVA","rafael.burbano@epn.edu.ec   rafaelburbanor@yahoo.es",null,"0987084460"]
["CAICEDO MENESES AZUCENA BELEN","1721064028","MATEMATICA","azucena.caicedo@epn.edu.ec",null,"098 862 9244","PROFESOR OCASIONAL"]
["CALAHORRANO RECALDE MARCO VINICIO","1706263231","MATEMATICA","marco.calahorrano@epn.edu.ec",1559,"09 98700922"]
["CAPA SANTOS HOLGER ANIBAL","1704109451","MATEMATICA","holger.capa@epn.edu.ec",1556,"09 99240768"]
["CARRERA ESTUPIÑAN JUAN PABLO","1710972934","BIOLOGIA","pablo.carrera@epn.edu.ec",null,"+1 (806) 317-7256"]
["CELI APOLO LUIS ALBERTO","0101649176","FISICA","alberto.celi@epn.edu.ec",1707,"099 820 3689"]
["CORTEZ ESTRELLA MANUEL FERNANDO","1716815897","MATEMATICA","manuel.cortez@epn.edu.ec",1588,"098 240 0069","PROFESOR OCASIONAL"]
{"$rows_left_out":67}
{"sheet":"Convenios","index":3,"n_rows":1974,"n_cols":8,"rows_kept":1974,"cut":false,"hidden":false,"merged":[]}
[null,"Nro.","CODIGO","NOMBRE","ESTADO","FINICIO","FFIN","Tipo"]
["Select",1,"PVI-19-01","Museo Astronómico y Arqueológico de Coaque: estudios preliminares, diseño y capacitación","En ejecución","2020-05-04","2021-11-03","Vinculación"]
["Select",2,"PVI-19-02","GEOLAB, plataforma virtual de aprendizaje de la Geología.","En ejecución","2020-05-04","2021-11-03","Vinculación"]
["Select",3,"PVI-19-03","Planeta Tierra: más alla de tus ojos","En ejecución","2020-05-04","2021-11-03","Vinculación"]
["Select",4,"PVI-19-04","Conocimiento de la actividad volcánica y sísmica de Galápagos orientado a los Guardaparques de la Dirección del Parque Nacional Galápagos","En ejecución","2020-05-04","2021-11-03","Vinculación"]
["Select",5,"PVI-19-05","Física Recreativa para estudiantes de Bachillerato General Unificado (BGU) con el uso de materiales reciclables","En ejecución","2020-05-04","2021-11-03","Vinculación"]
["Select",6,"PVI-19-06","Fortalecimiento cognitivo y comunitario para una mejor respuesta ante posibles eventos eruptivos en la comunidad San Agustín del Callo cercana al volcán Cotopaxi.","En ejecución","2020-05-04","2021-11-03","Vinculación"]
["Select",7,"PVI-19-07","Inclusión digital: Alfabetización informática","En ejecución","2020-05-04","2021-11-03","Vinculación"]
["Select",8,"PVI-DACI-2020-01","Desarrollo de habilidades técnicas en el área de robótica en los estudiantes de la Institución Educativa Fiscal Sucre","En ejecución","2020-05-04","2021-05-03","Vinculación"]
["Select",9,"PVI-DACI-2020-02","Desarrollo de habilidades técnicas en el área de robótica en los estudiantes de la Unidad Educativa Salesiana Don Bosco","En ejecución","2020-06-15","2021-06-14","Vinculación"]
["Select",10,"PVI-DCS-2020-01","Asesoría y capacitación musical y pedagógica para organizar grupos musicales de Coro y Conjunto de Cámara en las IES-caso UTA","En ejecución","2020-08-31","2021-06-30","Vinculación"]
["Select",11,"PVI-DEMEX-2020-01","Gestión integral del desperdicio de alimentos a través de la vinculación EPN y BAQ","En ejecución","2020-05-04","2021-05-03","Vinculación"]
["Select",12,"PVI-DICA-2020-01","Estudios para la ampliación de las bodegas del HESJD","Cierre especial","2020-03-11","2020-09-10","Vinculación"]
["Select",13,"PVI-DICA-2020-02","Capacitaciones a Albañiles Red Socio Empleo - Norte","En ejecución","2020-03-11","2020-09-10","Vinculación"]
["Select",14,"PVI-DICA-2020-03","Gestión de resíduos sólidos aprovechables inorgánicos FICA y orgánicos ESFOT (GROI-P)","En ejecución","2020-03-11","2021-03-10","Vinculación"]
["Select",15,"PVI-DICC-2020-01","Taller virtual colaborativo de Team Building para profesores de la Dirección Nacional de Escolaridad Inconclusa (DNEPEI) del Ministerio de Educación en tiempos Covid","En ejecución","2020-08-31","2021-08-30","Vinculación"]
["Select",16,"PVI-DIM-2020-01","Diseño de una máquina para mejorar registros en Halterofilia","Proceso de cierre","2020-03-11","2020-09-10","Vinculación"]
["Select",17,"PVI-DIM-2020-02","Diseño de una máquina simuladora de lanzamiento de jabalina con cargas regulables","En ejecución","2020-03-11","2020-09-10","Vinculación"]
["Select",18,"PVI-DIM-2020-03","Diseño de máquina ensambladora de válvulas para cilindros de gas","En ejecución","2020-03-11","2020-08-10","Vinculación"]
["Select",19,"PVI-DIM-2020-04","Diseño de muebles de cocina automatizados para personas con capacidades especiales","En ejecución","2020-03-11","2021-02-10","Vinculación"]
["Select",20,"PVI-DIM-2020-06","Definición de prácticas adecuadas en mantenimiento industrial en PYMES metalmecánicas","En ejecución","2020-05-25","2021-05-24","Vinculación"]
["Select",21,"PVI-DMT-2020-01","Mejoramiento en el sistema de procesamiento de basura en colaboración con la EMGIRS-EP","En ejecución","2020-03-11","2021-02-10","Vinculación"]
["Select",22,"PVI-DMT-2020-02","Diseño de un mecanismo extractor del alimento del tocte","En ejecución","2020-05-25","2021-05-24","Vinculación"]
["Select",23,"PVI-DMT-2020-03","Diseño de una máquina cortadora y despulpadora de cacao","Proceso de cierre","2020-03-11","2020-09-10","Vinculación"]
["Select",24,"PVI-ESFOT-2020-01","Niñas en las TIC de la Institución Educativa Quintiliano Sánchez","En ejecución","2020-03-11","2021-03-10","Vinculación"]
["Select",25,"PVI-ESFOT-2020-02","Fortalecimiento de las telecomunicaciones en las instituciones Educativa Quintiliano Sánchez","En ejecución","2020-03-11","2021-03-10","Vinculación"]
["Select",26,"PVI-ESFOT-2020-03","Rediseño del Sistema Eléctrico de la Institución Educativa Quintiliano Sánchez","En ejecución","2020-03-11","2020-08-10","Vinculación"]
["Select",27,"PVI-ESFOT-2020-04","Fortalecimiento de las TICs de la Institución Educativa Quintiliano Sánchez","En ejecución","2020-03-11","2021-03-10","Vinculación"]
["Select",28,"PVI-ESFOT-2020-05","Manejo integral de residuos sólidos en la Institución Educativa Quintiliano Sánchez","En ejecución","2020-03-11","2020-10-10","Vinculación"]
["Select",29,"PVS-2017-001","Implementación de un modelo de pronóstico de oleaje para prevención de riesgos","Cerrado","2017-01-03","2017-08-31","Vinculación"]
{"$rows_left_out":1945}
{"sheet":"VAL","index":4,"n_rows":90,"n_cols":15,"rows_kept":90,"cut":false,"hidden":true,"merged":[[23,0,26,0],[2,0,4,0],[5,0,7,0],[9,0,12,0],[14,0,16,0],[17,0,20,0],[21,0,22,0]]}
["Campo amplio","Campo específico",null,null,"Campo amplio","EDUCACION","ARTES Y HUMANIDADES","CIENCIAS SOCIALES, PERIODISMO, INFORMACION Y DERECHO","ADMINISTRACION","CIENCIAS NATURALES, MATEMATICAS Y ESTADISTICA","TECNOLOGIAS DE LA INFORMACION Y LA COMUNICACIÓN (TIC)","INGENIERIA, INSDUSTRIA Y CONSTRUCCIÓN","AGRICULTURA, SOLVICULTURA, PESCA Y VETERINARIA","SALUD Y BIENESTAR","SERVICIOS"]
["EDUCACION","Educación",null,null,"Campo específico","Educación","Artes","Ciencias sociales y del comportamiento","Educación comercial y administración","Ciencias biológicas y afines","Tecnologías de la información y la comunicación (TIC)","Ingeniería y profesiones afines","Agricultura","Salud","Servicios personales"]
["ARTES Y HUMANIDADES","Artes",null,null,null,null,"Humanidades","Periodismo e información",null,"Medio ambiente",null,"Industria y producción","Silvicultura","Bienestar","Servicios de protección"]
[null,"Humanidades",null,null,null,null,"Idiomas","Derecho",null,"Ciencias físicas",null,"Arquitectura y construcción","Pesca",null,"Servicios de seguridad"]
[null,"Idiomas",null,null,null,null,null,null,null,"Matemáticas y estadística",null,null,"Veterinaria",null,"Servicio de transporte"]
["CIENCIAS SOCIALES, PERIODISMO, INFORMACION Y DERECHO","Ciencias sociales y del comportamiento"]
[null,"Periodismo e información"]
[null,"Derecho"]
["ADMINISTRACION","Educación comercial y administración"]
["CIENCIAS NATURALES, MATEMATICAS Y ESTADISTICA","Ciencias biológicas y afines"]
[null,"Medio ambiente"]
[null,"Ciencias físicas"]
[null,"Matemáticas y estadística"]
["TECNOLOGIAS DE LA INFORMACION Y LA COMUNICACIÓN (TIC)","Tecnologías de la información y la comunicación (TIC)"]
["INGENIERIA, INDUSTRIA Y CONSTRUCCIÓN","Ingeniería y profesiones afines"]
[null,"Industria y producción"]
[null,"Arquitectura y construcción"]
["AGRICULTURA, SOLVICULTURA, PESCA Y VETERINARIA","Agricultura"]
[null,"Silvicultura"]
[null,"Pesca"]
[null,"Veterinaria"]
["SALUD Y BIENESTAR","Salud"]
[null,"Bienestar"]
["SERVICIOS","Servicios personales"]
[null,"Servicios de protección"]
[null,"Servicios de seguridad"]
[null,"Servicio de transporte"]
[]
[]
["Campo amplio"]
{"$rows_left_out":60}